{"text_format":"1","workbook":"xlsx","n_sheets":27,"sheets":["Main Menu","Module3","Module2","Module1","Options","Shooters","Sample Scores","Team Template","Scores","Scores Template","H","Results","Options Template","Awards","Awards Template","Labels","SR1 Card Template","Docs Menu","NRAReport","Team Scores","Documentation","Results Template","Docs Macros","Print Page for Labels","SR1 Card","Scorecard Indoor","Scorecard Outdoor"],"not_rendered":{"charts":0,"images":1,"macros":1,"external_links":0,"defined_names":7,"comments":5,"pivot_tables":0},"unopened":[{"sheet":"Module3","index":1,"reason":"part_missing"},{"sheet":"Module2","index":2,"reason":"part_missing"},{"sheet":"Module1","index":3,"reason":"part_missing"},{"sheet":"Docs Macros","index":22,"reason":"part_missing"}],"bounds":{"document_bytes":16777216,"sheet_cells":100000,"rows_first":2000,"rows_last":500,"rows_between":2000,"halvings":0,"cell_chars":16384,"cell_head_chars":4096},"cells_cut":0,"cells_raw":0,"read":"whole","date_system":"1900"}

{"sheet":"Main Menu","index":0,"n_rows":30,"n_cols":5,"rows_kept":30,"cut":false,"hidden":false,"merged":[[1,0,1,9],[3,4,3,5],[26,0,26,10],[27,0,27,10]]}
[]
["Bullseye (Precision Pistol) Workbook"]
["Use mouse to make a selection"]
[null,null,null,null,{"$f":"NOW()","v":"2018-09-23T15:39:55.940"}]
["If the above date is incorrect, adjust the system clock before continuing!"]
[]
[]
[]
{"$rows_left_out":23}
{"sheet":"Options","index":4,"n_rows":44,"n_cols":12,"rows_kept":44,"cut":false,"hidden":false,"merged":[[38,1,38,8]]}
["OPTIONS LIST (do not change placement!)","Opts",null,null,null,null,null,null,null,null,"The below information is used to fill in the SR1 Card"]
[]
["How many top places? (0-3):",1]
["Combine Masters with High Masters? (Y/N):","N",null,null,null,null,null,null,null,null,"First Name","John"]
["Combine Experts with Masters? (Y/N):","N",null,null,null,null,null,null,null,null,"Middle Initial","D."]
["Combine Sharpshooters with Experts? (Y/N):","N",null,null,null,null,null,null,null,null,"Last Name","Doe "]
["Combine Marksmen with Sharpshooters? (Y/N):","N",null,null,null,null,null,null,null,null,"NRA#","123456789"]
["Combine Unclassified with which class? (MA/MK) [UN for own class]:","MA",null,null,null,null,null,null,null,null,"Date of Birth"]
{"$rows_left_out":37}
{"sheet":"Shooters","index":5,"n_rows":3,"n_cols":131,"rows_kept":3,"cut":false,"hidden":false,"merged":[]}
[null,null,null,null,null,null,null,null,null,null,null,null,null,null,null,null,"Matches","Most","2nd most","3rd most","email Address","Phone#Day","Phone#Eve","DOB",null,null,null,null,null,null,null,null,null,null,null,null,null,null,null,null,null,null,null,null,null,null,null,null,null,null,null,null,{"$f":"COUNTA(E:E)-1","v":1},{"$f":"COUNTA(A:A)-1","v":0},null,null,null,null,null,null,null,null,null,null,null,null,null,null,null,null,null,null,null,null,null,null,null,null,null,null,null,null,null,null,null,null,null,null,null,null,null,null,null,null,null,null,null,null,3,6,null,null,null,null,null,null,null,null,null,null,null,null,null,null,null,null,null,null,null,null,null,null,null,null,null,null,null,null,null,null,3]
["Comp#","NRA#","First Name","MI.","Last Name","Sfx.","Address","City","State","Zip","Class","Category","Special","Special2","Special3","Special4","Attended","Recent","Recent","Recent"]
[null,"123456789","John","D.","Doe",null,"123 Any St","Any Town","US","00000","EX","CIV",null,null,null,null,1,"9/23/2018 "]

{"sheet":"Sample Scores","index":6,"n_rows":26,"n_cols":100,"rows_kept":26,"cut":false,"hidden":true,"merged":[]}
["Comp#","Competitor Name","22 Slow","22 NMC","22 Timed","22 Rapid","22 Agg","CF Slow","CF NMC","CF Timed","CF Rapid","CF Agg","45 Slow","45 NMC","45 Timed","45 Rapid","45 Agg","Grand Agg","Class","Category","Special","Special2","Special3","Special4","NRA#",null,"Shooter Awards Calculations",null,null,null,null,null,null,null,null,null,null,null,null,null,null,null,null,"Factor:",1,null,null,null,null,null,null,null,{"$f":"COUNTA(B:B)-2","v":18},18,null,null,null,null,null,null,null,null,null,null,null,null,null,null,null,null,null,null,null,null,null,null,null,null,null,null,null,null,null,null,null,null,null,null,null,null,null,null,null,null,null,null,null,null,null,16]
["NULL","NULL","0-0","0-0","0-0","0-0",{"$f":"VALUE(LEFT(C2,FIND(\"-\",C2)-1))+VALUE(LEFT(D2,FIND(\"-\",D2)-1))+VALUE(LEFT(E2,FIND(\"-\",E2)-1))+VALUE(LEFT(F2,FIND(\"-\",F2)-1))&\"-\"&VALUE(RIGHT(C2,(LEN(C2)-FIND(\"-\",C2))))+VALUE(RIGHT(D2,(LEN(D2)-FIND(\"-\",D2))))+VALUE(RIGHT(E2,(LEN(E2)-FIND(\"-\",E2))))+VALUE(RIGHT(F2,(LEN(F2)-FIND(\"-\",F2))))","v":"0-0"},"0-0","0-0","0-0","0-0",{"$f":"VALUE(LEFT(H2,FIND(\"-\",H2)-1))+VALUE(LEFT(I2,FIND(\"-\",I2)-1))+VALUE(LEFT(J2,FIND(\"-\",J2)-1))+VALUE(LEFT(K2,FIND(\"-\",K2)-1))&\"-\"&VALUE(RIGHT(H2,(LEN(H2)-FIND(\"-\",H2))))+VALUE(RIGHT(I2,(LEN(I2)-FIND(\"-\",I2))))+VALUE(RIGHT(J2,(LEN(J2)-FIND(\"-\",J2))))+VALUE(RIGHT(K2,(LEN(K2)-FIND(\"-\",K2))))","v":"0-0"},"0-0","0-0","0-0","0-0",{"$f":"VALUE(LEFT(M2,FIND(\"-\",M2)-1))+VALUE(LEFT(N2,FIND(\"-\",N2)-1))+VALUE(LEFT(O2,FIND(\"-\",O2)-1))+VALUE(LEFT(P2,FIND(\"-\",P2)-1))&\"-\"&VALUE(RIGHT(M2,(LEN(M2)-FIND(\"-\",M2))))+VALUE(RIGHT(N2,(LEN(N2)-FIND(\"-\",N2))))+VALUE(RIGHT(O2,(LEN(O2)-FIND(\"-\",O2))))+VALUE(RIGHT(P2,(LEN(P2)-FIND(\"-\",P2))))","v":"0-0"},{"$f":"VALUE(LEFT(G2,FIND(\"-\",G2)-1))+VALUE(LEFT(L2,FIND(\"-\",L2)-1))+VALUE(LEFT(Q2,FIND(\"-\",Q2)-1))&\"-\"&VALUE(RIGHT(G2,(LEN(G2)-FIND(\"-\",G2))))+VALUE(RIGHT(L2,(LEN(L2)-FIND(\"-\",L2))))+VALUE(RIGHT(Q2,(LEN(Q2)-FIND(\"-\",Q2))))","v":"0-0"},null,null,null,null,null,null,"NULL",null,1,2,3,4,5,6,7,8,9,10,11,12,13,14,15,16,{"$f":"(COUNTIF(AP2,\"W\")*$AT$6+(COUNTIF(AE2,\"W\")+COUNTIF(AJ2,\"W\")+COUNTIF(AO2,\"W\"))*$AT$13+(COUNTIF(AA2:AD2,\"W\")+COUNTIF(AF2:AI2,\"W\")+COUNTIF(AK2:AN2,\"W\"))*$AT$20+COUNTIF(AP2,\"1\")*$AT$9+(COUNTIF(AE2,\"1\")+COUNTIF(AJ2,\"1\")+COUNTIF(AO2,\"1\"))*$AT$16+(COUNTIF(AA2:AD2,\"1\")+COUNTIF(AF2:AI2,\"1\")+COUNTIF(AK2:AN2,\"1\"))*$AT$23+COUNTIF(AP2,\"S\")*$AT$7+(COUNTIF(AE2,\"S\")+COUNTIF(AJ2,\"S\")+COUNTIF(AO2,\"S\"))*$AT$14+(COUNTIF(AA2:AD2,\"S\")+COUNTIF(AF2:AI2,\"S\")+COUNTIF(AK2:AN2,\"S\"))*$AT$21+COUNTIF(AP2,\"T\")*$AT$8+(COUNTIF(AE2,\"T\")+COUNTIF(AJ2,\"T\")+COUNTIF(AO2,\"T\"))*$AT$15+(COUNTIF(AA2:AD2,\"T\")+COUNTIF(AF2:AI2,\"T\")+COUNTIF(AK2:AN2,\"T\"))*$AT$22+COUNTIF(AP2,\"2\")*$AT$10+(COUNTIF(AE2,\"2\")+COUNTIF(AJ2,\"2\")+COUNTIF(AO2,\"2\"))*$AT$17+(COUNTIF(AA2:AD2,\"2\")+COUNTIF(AF2:AI2,\"2\")+COUNTIF(AK2:AN2,\"2\"))*$AT$24+(COUNTIF(AA2:AP2,\">2\")*$AT$26))*$AS$1","v":16},"Total",{"$f":"SUM(AQ:AQ)-AQ2","v":0}]
["1001","TestHMCIV","192-4","295-15","200-14","196-9","883-42","189-8","290-5","197-10","188-6","864-29","191-5","289-10","197-8","191-7","868-30","2615-101","HM","CIV",null,null,null,null,"Test101",null,null,null,null,null,null,null,null,null,null,null,null,null,null,null,null,null,0,null,"Payout Schedule"]
[1002,"TestHMSER","190-6","294-12","199-14","200-14","883-46","191-3","292-10","197-8","196-11","876-32","192-3","287-11","199-12","193-8","871-34","2630-112","HM","SER","WOM",null,null,"USAF","Test102",null,null,null,null,null,null,null,null,null,null,null,null,null,null,null,null,null,0]
[1003,"TestHMPOL","190-4","295-15","199-12","195-7","879-38","186-4","295-11","199-8","197-8","877-31","185-3","286-16","198-8","197-11","866-38","2622-107","HM","POL","SEN","MD",null,null,"Test103",null,null,null,null,null,null,null,null,null,null,null,null,null,null,null,null,null,0,null,"Grand-Agg"]
[1004,"TestMACIV","187-1","291-9","198-13","198-12","874-35","184-5","295-13","198-11","194-8","871-37","189-6","294-12","198-10","195-6","876-34","2621-106","MA","CIV",null,null,null,null,"Test104",null,null,null,null,null,null,null,null,null,null,null,null,null,null,null,null,null,0,null,"Open Win:",5]
[1005,"TestMASER","185-2","288-9","199-13","197-10","869-34","186-6","284-7","195-11","179-5","844-29","182-3","283-9","193-11","195-5","853-28","2566-91","MA","SER",null,null,null,null,"Test105",null,null,null,null,null,null,null,null,null,null,null,null,null,null,null,null,null,0,null,"Open 2nd:",4]
[1006,"TestMAPOL","180-2","293-11","196-12","198-8","867-33","189-8","286-10","194-8","194-9","863-35","176-1","286-13","195-10","197-6","854-30","2584-98","MA","POL",null,null,null,null,"Test106",null,null,null,null,null,null,null,null,null,null,null,null,null,null,null,null,null,0,null,"Open 3rd:",3]
{"$rows_left_out":19}
{"sheet":"Team Template","index":7,"n_rows":12,"n_cols":9,"rows_kept":12,"cut":false,"hidden":true,"merged":[]}
["Team Matches"]
["Comp#","Names","22 NMC","22 Agg","CF NMC","CF Agg","45 NMC","45 Agg","Team Agg"]
[]
["Team:",null,null,null,null,null,null,"Class/Cat:"]
[null,"CompName1","0-0",null,"0-0",null,"0-0"]
[null,"CompName2","0-0",null,"0-0",null,"0-0"]
[null,"CompName3","0-0",null,"0-0",null,"0-0"]
[null,"CompName4","0-0",null,"0-0",null,"0-0"]
{"$rows_left_out":5}
{"sheet":"Scores","index":8,"n_rows":2,"n_cols":100,"rows_kept":2,"cut":false,"hidden":false,"merged":[]}
["Comp#","Competitor Name","22 Slow","22 NMC","22 Timed","22 Rapid","22 Agg","CF Slow","CF NMC","CF Timed","CF Rapid","CF Agg","45 Slow","45 NMC","45 Timed","45 Rapid","45 Agg","Grand Agg","Class","Category","Special","Special2","Special3",null,"NRA#",null,"Shooter Awards Calculations",null,null,null,null,null,null,null,null,null,null,null,null,null,null,null,null,"Factor:",2,null,null,null,null,null,null,null,{"$f":"COUNTA(B:B)-2","v":0},18,null,null,null,null,null,null,null,null,null,null,null,null,null,null,null,null,null,null,null,null,null,null,null,null,null,null,null,null,null,null,null,null,null,null,null,null,null,null,null,null,null,null,null,null,null,5]
["NULL","NULL","0-0","0-0","0-0","0-0",{"$f":"VALUE(LEFT(C2,FIND(\"-\",C2)-1))+VALUE(LEFT(D2,FIND(\"-\",D2)-1))+VALUE(LEFT(E2,FIND(\"-\",E2)-1))+VALUE(LEFT(F2,FIND(\"-\",F2)-1))&\"-\"&VALUE(RIGHT(C2,(LEN(C2)-FIND(\"-\",C2))))+VALUE(RIGHT(D2,(LEN(D2)-FIND(\"-\",D2))))+VALUE(RIGHT(E2,(LEN(E2)-FIND(\"-\",E2))))+VALUE(RIGHT(F2,(LEN(F2)-FIND(\"-\",F2))))","v":"0-0"},"0-0","0-0","0-0","0-0",{"$f":"VALUE(LEFT(H2,FIND(\"-\",H2)-1))+VALUE(LEFT(I2,FIND(\"-\",I2)-1))+VALUE(LEFT(J2,FIND(\"-\",J2)-1))+VALUE(LEFT(K2,FIND(\"-\",K2)-1))&\"-\"&VALUE(RIGHT(H2,(LEN(H2)-FIND(\"-\",H2))))+VALUE(RIGHT(I2,(LEN(I2)-FIND(\"-\",I2))))+VALUE(RIGHT(J2,(LEN(J2)-FIND(\"-\",J2))))+VALUE(RIGHT(K2,(LEN(K2)-FIND(\"-\",K2))))","v":"0-0"},"0-0","0-0","0-0","0-0",{"$f":"VALUE(LEFT(M2,FIND(\"-\",M2)-1))+VALUE(LEFT(N2,FIND(\"-\",N2)-1))+VALUE(LEFT(O2,FIND(\"-\",O2)-1))+VALUE(LEFT(P2,FIND(\"-\",P2)-1))&\"-\"&VALUE(RIGHT(M2,(LEN(M2)-FIND(\"-\",M2))))+VALUE(RIGHT(N2,(LEN(N2)-FIND(\"-\",N2))))+VALUE(RIGHT(O2,(LEN(O2)-FIND(\"-\",O2))))+VALUE(RIGHT(P2,(LEN(P2)-FIND(\"-\",P2))))","v":"0-0"},{"$f":"VALUE(LEFT(G2,FIND(\"-\",G2)-1))+VALUE(LEFT(L2,FIND(\"-\",L2)-1))+VALUE(LEFT(Q2,FIND(\"-\",Q2)-1))&\"-\"&VALUE(RIGHT(G2,(LEN(G2)-FIND(\"-\",G2))))+VALUE(RIGHT(L2,(LEN(L2)-FIND(\"-\",L2))))+VALUE(RIGHT(Q2,(LEN(Q2)-FIND(\"-\",Q2))))","v":"0-0"},null,null,null,null,null,null,"NULL",null,1,2,3,4,5,6,7,8,9,10,11,12,13,14,15,16,{"$f":"(COUNTIF(AP2,\"W\")*$BA$2+(COUNTIF(AE2,\"W\")+COUNTIF(AJ2,\"W\")+COUNTIF(AO2,\"W\"))*$BF$2+(COUNTIF(AA2:AD2,\"W\")+COUNTIF(AF2:AI2,\"W\")+COUNTIF(AK2:AN2,\"W\"))*$BK$2+COUNTIF(AP2,\"1\")*$BD$2+(COUNTIF(AE2,\"1\")+COUNTIF(AJ2,\"1\")+COUNTIF(AO2,\"1\"))*$BI$2+(COUNTIF(AA2:AD2,\"1\")+COUNTIF(AF2:AI2,\"1\")+COUNTIF(AK2:AN2,\"1\"))*$BN$2+COUNTIF(AP2,\"S\")*$BB$2+(COUNTIF(AE2,\"S\")+COUNTIF(AJ2,\"S\")+COUNTIF(AO2,\"S\"))*$BG$2+(COUNTIF(AA2:AD2,\"S\")+COUNTIF(AF2:AI2,\"S\")+COUNTIF(AK2:AN2,\"S\"))*$BL$2+COUNTIF(AP2,\"T\")*$BC$2+(COUNTIF(AE2,\"T\")+COUNTIF(AJ2,\"T\")+COUNTIF(AO2,\"T\"))*$BH$2+(COUNTIF(AA2:AD2,\"T\")+COUNTIF(AF2:AI2,\"T\")+COUNTIF(AK2:AN2,\"T\"))*$BM$2+COUNTIF(AP2,\"2\")*$BE$2+(COUNTIF(AE2,\"2\")+COUNTIF(AJ2,\"2\")+COUNTIF(AO2,\"2\"))*$BJ$2+(COUNTIF(AA2:AD2,\"2\")+COUNTIF(AF2:AI2,\"2\")+COUNTIF(AK2:AN2,\"2\"))*$BO$2+(COUNTIF(AA2:AP2,\">2\")*$BP$2))*$AS$1","v":140},"Total",{"$f":"SUM(AQ:AQ)-AQ2","v":0},"Awards",null,null,"Payout Schedule -->> (see Options) -->>",null,null,null,{"$f":"Options!H19","v":15},{"$f":"Options!H20","v":10},{"$f":"Options!H21","v":5},{"$f":"Options!H22","v":8},{"$f":"Options!H23","v":6},{"$f":"Options!H26","v":15},{"$f":"Options!H27","v":10},{"$f":"Options!H28","v":5},{"$f":"Options!H29","v":8},{"$f":"Options!H30","v":6},{"$f":"Options!H33","v":8},{"$f":"Options!H34","v":6},{"$f":"Options!H35","v":4},{"$f":"Options!H36","v":8},{"$f":"Options!H37","v":6},{"$f":"Options!H38","v":4}]

{"sheet":"Scores Template","index":9,"n_rows":2,"n_cols":100,"rows_kept":2,"cut":false,"hidden":true,"merged":[]}
["Comp#","Competitor Name","22 Slow","22 NMC","22 Timed","22 Rapid","22 Agg","CF Slow","CF NMC","CF Timed","CF Rapid","CF Agg","45 Slow","45 NMC","45 Timed","45 Rapid","45 Agg","Grand Agg","Class","Category","Special","Special2","Special3",null,"NRA#",null,"Shooter Awards Calculations",null,null,null,null,null,null,null,null,null,null,null,null,null,null,null,null,"Factor:",1,null,null,null,null,null,null,null,{"$f":"COUNTA(B:B)-2","v":0},18,null,null,null,null,null,null,null,null,null,null,null,null,null,null,null,null,null,null,null,null,null,null,null,null,null,null,null,null,null,null,null,null,null,null,null,null,null,null,null,null,null,null,null,null,null,16]
["NULL","NULL","0-0","0-0","0-0","0-0",{"$f":"VALUE(LEFT(C2,FIND(\"-\",C2)-1))+VALUE(LEFT(D2,FIND(\"-\",D2)-1))+VALUE(LEFT(E2,FIND(\"-\",E2)-1))+VALUE(LEFT(F2,FIND(\"-\",F2)-1))&\"-\"&VALUE(RIGHT(C2,(LEN(C2)-FIND(\"-\",C2))))+VALUE(RIGHT(D2,(LEN(D2)-FIND(\"-\",D2))))+VALUE(RIGHT(E2,(LEN(E2)-FIND(\"-\",E2))))+VALUE(RIGHT(F2,(LEN(F2)-FIND(\"-\",F2))))","v":"0-0"},"0-0","0-0","0-0","0-0",{"$f":"VALUE(LEFT(H2,FIND(\"-\",H2)-1))+VALUE(LEFT(I2,FIND(\"-\",I2)-1))+VALUE(LEFT(J2,FIND(\"-\",J2)-1))+VALUE(LEFT(K2,FIND(\"-\",K2)-1))&\"-\"&VALUE(RIGHT(H2,(LEN(H2)-FIND(\"-\",H2))))+VALUE(RIGHT(I2,(LEN(I2)-FIND(\"-\",I2))))+VALUE(RIGHT(J2,(LEN(J2)-FIND(\"-\",J2))))+VALUE(RIGHT(K2,(LEN(K2)-FIND(\"-\",K2))))","v":"0-0"},"0-0","0-0","0-0","0-0",{"$f":"VALUE(LEFT(M2,FIND(\"-\",M2)-1))+VALUE(LEFT(N2,FIND(\"-\",N2)-1))+VALUE(LEFT(O2,FIND(\"-\",O2)-1))+VALUE(LEFT(P2,FIND(\"-\",P2)-1))&\"-\"&VALUE(RIGHT(M2,(LEN(M2)-FIND(\"-\",M2))))+VALUE(RIGHT(N2,(LEN(N2)-FIND(\"-\",N2))))+VALUE(RIGHT(O2,(LEN(O2)-FIND(\"-\",O2))))+VALUE(RIGHT(P2,(LEN(P2)-FIND(\"-\",P2))))","v":"0-0"},{"$f":"VALUE(LEFT(G2,FIND(\"-\",G2)-1))+VALUE(LEFT(L2,FIND(\"-\",L2)-1))+VALUE(LEFT(Q2,FIND(\"-\",Q2)-1))&\"-\"&VALUE(RIGHT(G2,(LEN(G2)-FIND(\"-\",G2))))+VALUE(RIGHT(L2,(LEN(L2)-FIND(\"-\",L2))))+VALUE(RIGHT(Q2,(LEN(Q2)-FIND(\"-\",Q2))))","v":"0-0"},null,null,null,null,null,null,"NULL",null,1,2,3,4,5,6,7,8,9,10,11,12,13,14,15,16,{"$f":"(COUNTIF(AP2,\"W\")*$BA$2+(COUNTIF(AE2,\"W\")+COUNTIF(AJ2,\"W\")+COUNTIF(AO2,\"W\"))*$BF$2+(COUNTIF(AA2:AD2,\"W\")+COUNTIF(AF2:AI2,\"W\")+COUNTIF(AK2:AN2,\"W\"))*$BK$2+COUNTIF(AP2,\"1\")*$BD$2+(COUNTIF(AE2,\"1\")+COUNTIF(AJ2,\"1\")+COUNTIF(AO2,\"1\"))*$BI$2+(COUNTIF(AA2:AD2,\"1\")+COUNTIF(AF2:AI2,\"1\")+COUNTIF(AK2:AN2,\"1\"))*$BN$2+COUNTIF(AP2,\"S\")*$BB$2+(COUNTIF(AE2,\"S\")+COUNTIF(AJ2,\"S\")+COUNTIF(AO2,\"S\"))*$BG$2+(COUNTIF(AA2:AD2,\"S\")+COUNTIF(AF2:AI2,\"S\")+COUNTIF(AK2:AN2,\"S\"))*$BL$2+COUNTIF(AP2,\"T\")*$BC$2+(COUNTIF(AE2,\"T\")+COUNTIF(AJ2,\"T\")+COUNTIF(AO2,\"T\"))*$BH$2+(COUNTIF(AA2:AD2,\"T\")+COUNTIF(AF2:AI2,\"T\")+COUNTIF(AK2:AN2,\"T\"))*$BM$2+COUNTIF(AP2,\"2\")*$BE$2+(COUNTIF(AE2,\"2\")+COUNTIF(AJ2,\"2\")+COUNTIF(AO2,\"2\"))*$BJ$2+(COUNTIF(AA2:AD2,\"2\")+COUNTIF(AF2:AI2,\"2\")+COUNTIF(AK2:AN2,\"2\"))*$BO$2+(COUNTIF(AA2:AP2,\">2\")*$BP$2))*$AS$1","v":70},"Total",{"$f":"SUM(AQ:AQ)-AQ2","v":0},null,null,null,"Payout Schedule -->> (see Options) -->>",null,null,null,{"$f":"Options!H19","v":15},{"$f":"Options!H20","v":10},{"$f":"Options!H21","v":5},{"$f":"Options!H22","v":8},{"$f":"Options!H23","v":6},{"$f":"Options!H26","v":15},{"$f":"Options!H27","v":10},{"$f":"Options!H28","v":5},{"$f":"Options!H29","v":8},{"$f":"Options!H30","v":6},{"$f":"Options!H33","v":8},{"$f":"Options!H34","v":6},{"$f":"Options!H35","v":4},{"$f":"Options!H36","v":8},{"$f":"Options!H37","v":6},{"$f":"Options!H38","v":4}]

{"sheet":"H","index":10,"n_rows":16,"n_cols":24,"rows_kept":16,"cut":false,"hidden":true,"merged":[[6,17,6,21],[0,0,2,0],[5,1,5,2],[6,0,6,2],[6,5,6,9],[6,11,6,15],[15,0,15,2],[8,0,8,2],[10,0,10,2],[11,1,11,2],[12,1,12,2],[13,0,13,2],[14,0,14,2]]}
[]
[null,"Bullseye Pistol 900 Match"]
[null,null,"Title, Date"]
[]
["Comp#","Cls/Cat","Competitor","NRA #",null,"Slow","NMC","Timed","Rapid","Sub Agg",null,"Slow","NMC","Timed","Rapid","Sub Agg",null,"Slow","NMC","Timed","Rapid","Sub Agg",null,"Grand"]
[null,"Open Winners"]
["First Place",null,null,null,null,"22 Caliber",null,null,null,null,null,"Center Fire Caliber",null,null,null,null,null,"45 Caliber",null,null,null,null,null,"Aggregate"]
[]
{"$rows_left_out":9}
{"sheet":"Results","index":11,"n_rows":0,"n_cols":0,"rows_kept":0,"cut":false,"hidden":false,"merged":[]}

{"sheet":"Options Template","index":12,"n_rows":44,"n_cols":12,"rows_kept":44,"cut":false,"hidden":true,"merged":[[38,1,38,8]]}
["OPTIONS LIST (do not change placement!)","Opts",null,null,null,null,null,null,null,null,"The below information is used to fill in the SR1 Card"]
[]
["How many top places? (0-3):",1]
["Combine Masters with High Masters? (Y/N):","N",null,null,null,null,null,null,null,null,"First Name","John"]
["Combine Experts with Masters? (Y/N):","N",null,null,null,null,null,null,null,null,"Middle Initial","D."]
["Combine Sharpshooters with Experts? (Y/N):","N",null,null,null,null,null,null,null,null,"Last Name","Doe "]
["Combine Marksmen with Sharpshooters? (Y/N):","N",null,null,null,null,null,null,null,null,"NRA#","123456789"]
["Combine Unclassified with which class? (MA/MK) [UN for own class]:","MA",null,null,null,null,null,null,null,null,"Date of Birth"]
{"$rows_left_out":37}
{"sheet":"Awards","index":13,"n_rows":174,"n_cols":2,"rows_kept":174,"cut":false,"hidden":false,"merged":[]}
[{"$f":"Options!B39","v":"Test Bullseye Match"}]
["Award Schedule"]
[]
["Overall Winners"]
[]
["Open Winner","Gold Medal"]
["Second Place","Silver Medal"]
["Third Place","Bronze Medal"]
{"$rows_left_out":167}
{"sheet":"Awards Template","index":14,"n_rows":174,"n_cols":2,"rows_kept":174,"cut":false,"hidden":true,"merged":[]}
[{"$f":"Options!B39","v":"Test Bullseye Match"}]
["Award Schedule"]
[]
["Overall Winners"]
[]
["Open Winner","Gold Medal"]
["Second Place","Silver Medal"]
["Third Place","Bronze Medal"]
{"$rows_left_out":167}
{"sheet":"Labels","index":15,"n_rows":0,"n_cols":0,"rows_kept":0,"cut":false,"hidden":false,"merged":[]}

{"sheet":"SR1 Card Template","index":16,"n_rows":50,"n_cols":3,"rows_kept":50,"cut":false,"hidden":true,"merged":[]}
["STATISTICAL OFFICE RECORD",null,"CIRCLE THE NUMBER OF EACH MATCH YOU WISH TO "]
["NRA CONVENTIONAL TOURNAMENTS ONLY",null,"ENTER:               All individual Matches (Check) [ ]"]
["(To be retained by Sponsor)",null,"1        2        3        4       5        6        7        8        9        10"]
[null,null,"11     12       13      14     15      16      17      18       19        20"]
[{"$f":"\"     \"&Options!L4&\" \"&Options!L5&\" \"&Options!L6","v":"     John D. Doe "}]
[" (Print)                    NAME                      COMP #",null,"I WILL FIRE TEAM MATCH NUMBER ______________________"]
[]
[{"$f":"\"     \"&Options!L9","v":"     123 Any St"},null,{"$f":"\" \"&Options!L15&\" \"","v":"  "}]
{"$rows_left_out":43}
{"sheet":"Docs Menu","index":17,"n_rows":2,"n_cols":2,"rows_kept":2,"cut":false,"hidden":false,"merged":[]}
[]
[null,"Quick Menu for Documentation (choose a button)"]

{"sheet":"NRAReport","index":18,"n_rows":4,"n_cols":5,"rows_kept":4,"cut":false,"hidden":false,"merged":[]}
["NRA Reporting Information"]
["Date:",null,"Type:"]
[]
["NRA#","Total Shots","Total Score","Name","Address"]

{"sheet":"Team Scores","index":19,"n_rows":12,"n_cols":9,"rows_kept":12,"cut":false,"hidden":false,"merged":[]}
["Team Matches"]
["Comp#","Names","22 NMC","22 Agg","CF NMC","CF Agg","45 NMC","45 Agg","Team Agg"]
[]
["Team:",null,null,null,null,null,null,"Class/Cat:"]
[null,"CompName1","0-0",null,"0-0",null,"0-0"]
[null,"CompName2","0-0",null,"0-0",null,"0-0"]
[null,"CompName3","0-0",null,"0-0",null,"0-0"]
[null,"CompName4","0-0",null,"0-0",null,"0-0"]
{"$rows_left_out":5}
{"sheet":"Documentation","index":20,"n_rows":600,"n_cols":2,"rows_kept":600,"cut":false,"hidden":false,"merged":[]}
[null,"Bullseye Scoresheet Documentation"]
[null,"By Edwin C. Hall"]
[]
[]
[null,"This application was created by Edwin C. Hall.  Questions, comments or"]
[null,"donations (if you think this package is worth a monetary award) should"]
[null,"be sent to 15 Lakeview Ave, Tupper Lake, NY 12986.  These sheets and the"]
[null,"accompanying procedures were designed to provide a basis for 2700"]
{"$rows_left_out":593}
{"sheet":"Results Template","index":21,"n_rows":2,"n_cols":35,"rows_kept":2,"cut":false,"hidden":true,"merged":[]}
[null,null,null,null,"22 Caliber Sub-Aggregate",null,null,null,null,null,null,null,null,null,"Center Fire Caliber Sub-Aggregate",null,null,null,null,null,null,null,null,null,"45 Caliber Sub-Aggregate",null,null,null,null,null,null,null,null,null,"Final"]
["Comp#","Cls/Cat","Competitor","NRA #","Slow",null,"NMC",null,"Timed",null,"Rapid",null,"Sub-Agg",null,"Slow",null,"NMC",null,"Timed",null,"Rapid",null,"Sub-Agg",null,"Slow",null,"NMC",null,"Timed",null,"Rapid",null,"Sub-Agg",null,"Grand Agg"]

{"sheet":"Print Page for Labels","index":23,"n_rows":270,"n_cols":3,"rows_kept":270,"cut":false,"hidden":false,"merged":[]}
[{"$f":"IF(Labels!A1<>\"\",Labels!A1,\"\")","v":""},{"$f":"IF(Labels!A2<>\"\",Labels!A2,\"\")","v":""},{"$f":"IF(Labels!A3<>\"\",Labels!A3,\"\")","v":""}]
[{"$f":"IF(Labels!B1<>\"\",Labels!B1,\"\")","v":""},{"$f":"IF(Labels!B2<>\"\",Labels!B2,\"\")","v":""},{"$f":"IF(Labels!B3<>\"\",Labels!B3,\"\")","v":""}]
[{"$f":"IF(Labels!C1<>\"\",Labels!C1,\"\")","v":""},{"$f":"IF(Labels!C2<>\"\",Labels!C2,\"\")","v":""},{"$f":"IF(Labels!C3<>\"\",Labels!C3,\"\")","v":""}]
[{"$f":"IF(Labels!A4<>\"\",Labels!A4,\"\")","v":""},{"$f":"IF(Labels!A5<>\"\",Labels!A5,\"\")","v":""},{"$f":"IF(Labels!A6<>\"\",Labels!A6,\"\")","v":""}]
[{"$f":"IF(Labels!B4<>\"\",Labels!B4,\"\")","v":""},{"$f":"IF(Labels!B5<>\"\",Labels!B5,\"\")","v":""},{"$f":"IF(Labels!B6<>\"\",Labels!B6,\"\")","v":""}]
[{"$f":"IF(Labels!C4<>\"\",Labels!C4,\"\")","v":""},{"$f":"IF(Labels!C5<>\"\",Labels!C5,\"\")","v":""},{"$f":"IF(Labels!C6<>\"\",Labels!C6,\"\")","v":""}]
[{"$f":"IF(Labels!A7<>\"\",Labels!A7,\"\")","v":""},{"$f":"IF(Labels!A8<>\"\",Labels!A8,\"\")","v":""},{"$f":"IF(Labels!A9<>\"\",Labels!A9,\"\")","v":""}]
[{"$f":"IF(Labels!B7<>\"\",Labels!B7,\"\")","v":""},{"$f":"IF(Labels!B8<>\"\",Labels!B8,\"\")","v":""},{"$f":"IF(Labels!B9<>\"\",Labels!B9,\"\")","v":""}]
{"$rows_left_out":263}
{"sheet":"SR1 Card","index":24,"n_rows":50,"n_cols":3,"rows_kept":50,"cut":false,"hidden":false,"merged":[]}
["STATISTICAL OFFICE RECORD",null,"CIRCLE THE NUMBER OF EACH MATCH YOU WISH TO "]
["NRA CONVENTIONAL TOURNAMENTS ONLY",null,"ENTER:               All individual Matches (Check) [ ]"]
["(To be retained by Sponsor)",null,"1        2        3        4       5        6        7        8        9        10"]
[null,null,"11     12       13      14     15      16      17      18       19        20"]
[{"$f":"\"     \"&Options!L4&\" \"&Options!L5&\" \"&Options!L6","v":"     John D. Doe "}]
[" (Print)                    NAME                      COMP #",null,"I WILL FIRE TEAM MATCH NUMBER ______________________"]
[]
[{"$f":"\"     \"&Options!L9","v":"     123 Any St"},null,{"$f":"\" \"&Options!L15&\" \"","v":"  "}]
{"$rows_left_out":43}
{"sheet":"Scorecard Indoor","index":25,"n_rows":75,"n_cols":14,"rows_kept":75,"cut":false,"hidden":false,"merged":[]}
[]
[]
[]
[null,"Comp #","Competitor Name",null,null,null,null,"Date",null,"Caliber",null,"Relay","Target"]
[null,null,1,2,3,4,5,6,7,8,9,10,"Score"]
[null,"Slow Fire"]
[null,"Target 1",null,null,null,null,null,null,null,null,null,null,null,"Slow Fire"]
[null,null,1,2,3,4,5,6,7,8,9,10,"Score","Match Total"]
{"$rows_left_out":68}
{"sheet":"Scorecard Outdoor","index":26,"n_rows":75,"n_cols":14,"rows_kept":75,"cut":false,"hidden":false,"merged":[]}
[]
[]
[]
[null,"Comp #","Competitor Name",null,null,null,null,"Date",null,"Caliber",null,"Relay","Target"]
[null,null,1,2,3,4,5,6,7,8,9,10,"Score"]
[null,"Slow Fire"]
[null,"Target 1",null,null,null,null,null,null,null,null,null,null,null,"Slow Fire"]
[null,null,1,2,3,4,5,6,7,8,9,10,"Score","Match Total"]
{"$rows_left_out":67}